BDBM50306781 5-amino-N-(4-fluorophenyl)-7-thia-1,9-diazatetracyclo[9.2.2.0^{2,10}.0^{4,8}]pentadeca-2,4(8),5,9-tetraene-6-carboxamide::CHEMBL601207
SMILES Nc1c(sc2nc3C4CCN(CC4)c3cc12)C(=O)Nc1ccc(F)cc1
InChI Key InChIKey=QAJKNZOZVLHYQY-UHFFFAOYSA-N
Data  1 KI
  Tab Delimited (TSV)   2D SDfile   Computed 3D by Vconf -m prep SDfile
Find this compound or compounds like it in BindingDB:
Activity Spreadsheet -- Enzyme Inhibition Constant Data from BindingDB
Found 1 hit for monomerid = 50306781
TargetAdenosine receptor A2a(Homo sapiens (Human))
The Scripps Research Institute
Curated by ChEMBL
LigandPNGBDBM50306781(5-amino-N-(4-fluorophenyl)-7-thia-1,9-diazatetracy...)
Affinity DataKi: >1.00E+5nM. Assay description: Inhibition of human adenosine 2A receptor
In DepthDetails ArticlePubMed