BDBM50306798 CHEMBL604125::rac-6-hydroxy-8-(1-hydroxy-2-(1-(3-methoxyphenyl)-2-methylpropan-2-ylamino)ethyl)-2H-benzo[b][1,4]oxazin-3(4H)-one
SMILES COc1cccc(CC(C)(C)NCC(O)c2cc(O)cc3NC(=O)COc23)c1
InChI Key InChIKey=DTNVYZQGITUDPJ-UHFFFAOYSA-N
Data  2 EC50
  Tab Delimited (TSV)   2D SDfile   Computed 3D by Vconf -m prep SDfile
Find this compound or compounds like it in BindingDB:
Activity Spreadsheet -- Enzyme Inhibition Constant Data from BindingDB
Found 2 hits for monomerid = 50306798
TargetBeta-1 adrenergic receptor(Homo sapiens (Human))
Boehringer Ingelheim Pharma
Curated by ChEMBL
LigandPNGBDBM50306798(CHEMBL604125 | rac-6-hydroxy-8-(1-hydroxy-2-(1-(3-...)
Affinity DataEC50:  278nM. Assay description: Agonist activity at human recombinant adrenergic beta-1 receptor expressed in CHO cells assessed as cAMP accumulation
In DepthDetails ArticlePubMed
TargetBeta-2 adrenergic receptor(Homo sapiens (Human))
Boehringer Ingelheim Pharma
Curated by ChEMBL
LigandPNGBDBM50306798(CHEMBL604125 | rac-6-hydroxy-8-(1-hydroxy-2-(1-(3-...)
Affinity DataEC50:  14nM. Assay description: Agonist activity at human recombinant adrenergic beta2 receptor expressed in CHO cells assessed as cAMP accumulation
In DepthDetails ArticlePubMed