BDBM50306804 CHEMBL603274::rac-8-(2-(1-(4-chlorophenyl)-2-methylpropan-2-ylamino)-1-hydroxyethyl)-6-hydroxy-2H-benzo[b][1,4]oxazin-3(4H)-one
SMILES CC(C)(Cc1ccc(Cl)cc1)NCC(O)c1cc(O)cc2NC(=O)COc12
InChI Key InChIKey=JLPFCLPUWJYNLF-UHFFFAOYSA-N
Data  2 EC50
  Tab Delimited (TSV)   2D SDfile   Computed 3D by Vconf -m prep SDfile
Find this compound or compounds like it in BindingDB:
Activity Spreadsheet -- Enzyme Inhibition Constant Data from BindingDB
Found 2 hits for monomerid = 50306804
TargetBeta-1 adrenergic receptor(Homo sapiens (Human))
Boehringer Ingelheim Pharma
Curated by ChEMBL
LigandPNGBDBM50306804(CHEMBL603274 | rac-8-(2-(1-(4-chlorophenyl)-2-meth...)
Affinity DataEC50:  171nM. Assay description: Agonist activity at human recombinant adrenergic beta-1 receptor expressed in CHO cells assessed as cAMP accumulation
In DepthDetails ArticlePubMed
TargetBeta-2 adrenergic receptor(Homo sapiens (Human))
Boehringer Ingelheim Pharma
Curated by ChEMBL
LigandPNGBDBM50306804(CHEMBL603274 | rac-8-(2-(1-(4-chlorophenyl)-2-meth...)
Affinity DataEC50:  1.30nM. Assay description: Agonist activity at human recombinant adrenergic beta2 receptor expressed in CHO cells assessed as cAMP accumulation
In DepthDetails ArticlePubMed