BDBM50306839 CHEMBL601885::N-(Cyclohexylmethyl)-N-[3-(4-(2-methoxyphenyl)-piperazin-1-yl)-propyl]quinoline-8-sulfonamide
SMILES COc1ccccc1N1CCN(CCCN(CC2CCCCC2)S(=O)(=O)c2cccc3cccnc23)CC1
InChI Key InChIKey=AGDOTHDBWYNHAX-UHFFFAOYSA-N
Data  3 IC50
  Tab Delimited (TSV)   2D SDfile   Computed 3D by Vconf -m prep SDfile
Find this compound or compounds like it in BindingDB:
Activity Spreadsheet -- Enzyme Inhibition Constant Data from BindingDB
Found 3 hits for monomerid = 50306839
Target5-hydroxytryptamine receptor 2C(Homo sapiens (Human))
Ewha Womans University
Curated by ChEMBL
LigandPNGBDBM50306839(CHEMBL601885 | N-(Cyclohexylmethyl)-N-[3-(4-(2-met...)
Affinity DataIC50:  118nM. Assay description: Displacement of [3H]mesulergine from human recombinant 5HT2C receptor expressed in CHO-K1 cells
In DepthDetails ArticlePubMed
Target5-hydroxytryptamine receptor 2A(Homo sapiens (Human))
Ewha Womans University
Curated by ChEMBL
LigandPNGBDBM50306839(CHEMBL601885 | N-(Cyclohexylmethyl)-N-[3-(4-(2-met...)
Affinity DataIC50:  59.9nM. Assay description: Displacement of [3H]ketanserin from human recombinant 5HT2A receptor expressed in avCHO-K1 cells
In DepthDetails ArticlePubMed
Target5-hydroxytryptamine receptor 7(Homo sapiens (Human))
Ewha Womans University
Curated by ChEMBL
LigandPNGBDBM50306839(CHEMBL601885 | N-(Cyclohexylmethyl)-N-[3-(4-(2-met...)
Affinity DataIC50:  24nM. Assay description: Displacement of [3H]LSD from human recombinant 5HT7 receptor expressed in CHO cells
In DepthDetails ArticlePubMed