BDBM50307011 (4S)5-[4-(Butoxycarbonyl)piperazin-1-yl]-4-{[(4-{4-[(methylamino)ethyl]piperidin-1-yl}-6-phenylpyridin-2-yl)carbonyl]amino}-5-oxopentanoic Acid::(S)-5-(4-(butoxycarbonyl)piperazin-1-yl)-4-(4-(4-((methylamino)methyl)piperidin-1-yl)-6-phenylpicolinamido)-5-oxopentanoic acid::CHEMBL589518
SMILES CCCCOC(=O)N1CCN(CC1)C(=O)[C@H](CCC(O)=O)NC(=O)c1cc(cc(n1)-c1ccccc1)N1CCC(CNC)CC1
InChI Key InChIKey=KQIGSADDMXCJMD-MHZLTWQESA-N
Data  2 KI
  Tab Delimited (TSV)   2D SDfile   Computed 3D by Vconf -m prep SDfile
Find this compound or compounds like it in BindingDB:
Activity Spreadsheet -- Enzyme Inhibition Constant Data from BindingDB
Found 2 hits for monomerid = 50307011
TargetP2Y purinoceptor 12(Homo sapiens (Human))
Pfizer
Curated by ChEMBL
LigandPNGBDBM50307011((4S)5-[4-(Butoxycarbonyl)piperazin-1-yl]-4-{[(4-{4...)
Affinity DataKi:  4nM. Assay description: Inhibition of human P2Y12 receptor expressed in CHO cells
In DepthDetails ArticlePubMed
TargetP2Y purinoceptor 12(Homo sapiens (Human))
Pfizer
Curated by ChEMBL
LigandPNGBDBM50307011((4S)5-[4-(Butoxycarbonyl)piperazin-1-yl]-4-{[(4-{4...)
Affinity DataKi:  4nM. Assay description: Displacement of [33P]ADP from human recombinant P2Y12 receptor expressed in CHO cells
In DepthDetails ArticlePubMed