BDBM50307016 CHEMBL599747::N-(2-hydroxy-2-(4-hydroxyphenyl)ethyl)-3-(4-hydroxyphenyl)-2-methoxyacrylamide
SMILES CO\C(=C/c1ccc(O)cc1)C(=O)NCC(O)c1ccc(O)cc1
InChI Key InChIKey=DEIGDDBJHQFPRY-YVLHZVERSA-N
Data  1 IC50
  Tab Delimited (TSV)   2D SDfile   Computed 3D by Vconf -m prep SDfile
Find this compound or compounds like it in BindingDB:
Activity Spreadsheet -- Enzyme Inhibition Constant Data from BindingDB
Found 1 hit for monomerid = 50307016
TargetBroad substrate specificity ATP-binding cassette transporter ABCG2(Homo sapiens (Human))
Ritsumeikan University
Curated by ChEMBL
LigandPNGBDBM50307016(CHEMBL599747 | N-(2-hydroxy-2-(4-hydroxyphenyl)eth...)
Affinity DataIC50: >1.00E+5nM. Assay description: Inhibition of ABCG2 expressed in human NCI-H460/MX20 cells assessed as accumulation of ABCG2 substrate pheophorbide-A
In DepthDetails ArticlePubMed