BDBM50307067 4-Nitrophenyl 4-(Hydroxydiphenylmethyl)piperidine-1-carboxylate::CHEMBL602292
SMILES OC(C1CCN(CC1)C(=O)Oc1ccc(cc1)[N+]([O-])=O)(c1ccccc1)c1ccccc1
InChI Key InChIKey=JVDBYHMYZZPANM-UHFFFAOYSA-N
Data  3 IC50
  Tab Delimited (TSV)   2D SDfile   Computed 3D by Vconf -m prep SDfile
Find this compound or compounds like it in BindingDB:
Activity Spreadsheet -- Enzyme Inhibition Constant Data from BindingDB
Found 3 hits for monomerid = 50307067
TargetMonoacylglycerol lipase ABHD6(Mus musculus (mouse))
The Scripps Research Institute
Curated by ChEMBL
LigandPNGBDBM50307067(4-Nitrophenyl 4-(Hydroxydiphenylmethyl)piperidine-...)
Affinity DataIC50:  1.10E+3nM. Assay description: Inhibition of ABHD6 in mouse brain membrane
In DepthDetails ArticlePubMed
TargetMonoglyceride lipase(Mus musculus (mouse))
The Scripps Research Institute
Curated by ChEMBL
LigandPNGBDBM50307067(4-Nitrophenyl 4-(Hydroxydiphenylmethyl)piperidine-...)
Affinity DataIC50:  690nM. Assay description: Inhibition of MAGL in mouse brain membrane
In DepthDetails ArticlePubMed
TargetFatty-acid amide hydrolase 1(Mus musculus (mouse))
The Scripps Research Institute
Curated by ChEMBL
LigandPNGBDBM50307067(4-Nitrophenyl 4-(Hydroxydiphenylmethyl)piperidine-...)
Affinity DataIC50:  4.34E+3nM. Assay description: Inhibition of FAAH in mouse brain membrane
In DepthDetails ArticlePubMed