BDBM50307069 4-Nitrophenyl 4-(3-(p-Tolyloxy)benzyl)piperazine-1-carboxylate::CHEMBL600428
SMILES Cc1ccc(Oc2cccc(CN3CCN(CC3)C(=O)Oc3ccc(cc3)[N+]([O-])=O)c2)cc1
InChI Key InChIKey=PNDGXRXVUAOTAB-UHFFFAOYSA-N
Data  3 IC50
  Tab Delimited (TSV)   2D SDfile   Computed 3D by Vconf -m prep SDfile
Find this compound or compounds like it in BindingDB:
Activity Spreadsheet -- Enzyme Inhibition Constant Data from BindingDB
Found 3 hits for monomerid = 50307069
TargetMonoacylglycerol lipase ABHD6(Mus musculus (mouse))
The Scripps Research Institute
Curated by ChEMBL
LigandPNGBDBM50307069(4-Nitrophenyl 4-(3-(p-Tolyloxy)benzyl)piperazine-1...)
Affinity DataIC50:  1.13E+3nM. Assay description: Inhibition of ABHD6 in mouse brain membrane
In DepthDetails ArticlePubMed
TargetMonoglyceride lipase(Mus musculus (mouse))
The Scripps Research Institute
Curated by ChEMBL
LigandPNGBDBM50307069(4-Nitrophenyl 4-(3-(p-Tolyloxy)benzyl)piperazine-1...)
Affinity DataIC50:  500nM. Assay description: Inhibition of MAGL in mouse brain membrane
In DepthDetails ArticlePubMed
TargetFatty-acid amide hydrolase 1(Mus musculus (mouse))
The Scripps Research Institute
Curated by ChEMBL
LigandPNGBDBM50307069(4-Nitrophenyl 4-(3-(p-Tolyloxy)benzyl)piperazine-1...)
Affinity DataIC50:  40nM. Assay description: Inhibition of FAAH in mouse brain membrane
In DepthDetails ArticlePubMed