BDBM50307082 4-Nitrophenyl 4-(3-(3-(Trifluoromethyl)phenoxy)benzyl)piperazine-1-carboxylate::CHEMBL601002
SMILES [O-][N+](=O)c1ccc(OC(=O)N2CCN(Cc3cccc(Oc4cccc(c4)C(F)(F)F)c3)CC2)cc1
InChI Key InChIKey=NBDVCGACKSTXRD-UHFFFAOYSA-N
Data  3 IC50
  Tab Delimited (TSV)   2D SDfile   Computed 3D by Vconf -m prep SDfile
Find this compound or compounds like it in BindingDB:
Activity Spreadsheet -- Enzyme Inhibition Constant Data from BindingDB
Found 3 hits for monomerid = 50307082
TargetFatty-acid amide hydrolase 1(Mus musculus (mouse))
The Scripps Research Institute
Curated by ChEMBL
LigandPNGBDBM50307082(4-Nitrophenyl 4-(3-(3-(Trifluoromethyl)phenoxy)ben...)
Affinity DataIC50:  5nM. Assay description: Inhibition of FAAH in mouse brain membrane
In DepthDetails ArticlePubMed
TargetMonoacylglycerol lipase ABHD6(Mus musculus (mouse))
The Scripps Research Institute
Curated by ChEMBL
LigandPNGBDBM50307082(4-Nitrophenyl 4-(3-(3-(Trifluoromethyl)phenoxy)ben...)
Affinity DataIC50:  320nM. Assay description: Inhibition of ABHD6 in mouse brain membrane
In DepthDetails ArticlePubMed
TargetMonoglyceride lipase(Mus musculus (mouse))
The Scripps Research Institute
Curated by ChEMBL
LigandPNGBDBM50307082(4-Nitrophenyl 4-(3-(3-(Trifluoromethyl)phenoxy)ben...)
Affinity DataIC50:  300nM. Assay description: Inhibition of MAGL in mouse brain membrane
In DepthDetails ArticlePubMed