BDBM50307089 4-Nitrophenyl 4-(4-(Benzyloxy)-2-methoxybenzyl)piperazine-1-carboxylate::CHEMBL602283
SMILES COc1cc(OCc2ccccc2)ccc1CN1CCN(CC1)C(=O)Oc1ccc(cc1)[N+]([O-])=O
InChI Key InChIKey=KDNIASXXWANUBP-UHFFFAOYSA-N
Data  3 IC50
  Tab Delimited (TSV)   2D SDfile   Computed 3D by Vconf -m prep SDfile
Find this compound or compounds like it in BindingDB:
Activity Spreadsheet -- Enzyme Inhibition Constant Data from BindingDB
Found 3 hits for monomerid = 50307089
TargetFatty-acid amide hydrolase 1(Mus musculus (mouse))
The Scripps Research Institute
Curated by ChEMBL
LigandPNGBDBM50307089(4-Nitrophenyl 4-(4-(Benzyloxy)-2-methoxybenzyl)pip...)
Affinity DataIC50:  930nM. Assay description: Inhibition of FAAH in mouse brain membrane
In DepthDetails ArticlePubMed
TargetMonoacylglycerol lipase ABHD6(Mus musculus (mouse))
The Scripps Research Institute
Curated by ChEMBL
LigandPNGBDBM50307089(4-Nitrophenyl 4-(4-(Benzyloxy)-2-methoxybenzyl)pip...)
Affinity DataIC50:  310nM. Assay description: Inhibition of ABHD6 in mouse brain membrane
In DepthDetails ArticlePubMed
TargetMonoglyceride lipase(Mus musculus (mouse))
The Scripps Research Institute
Curated by ChEMBL
LigandPNGBDBM50307089(4-Nitrophenyl 4-(4-(Benzyloxy)-2-methoxybenzyl)pip...)
Affinity DataIC50:  90nM. Assay description: Inhibition of MAGL in mouse brain membrane
In DepthDetails ArticlePubMed