BDBM50307090 4-Nitrophenyl 4-(Bis(4-chlorophenyl)(hydroxy)methyl)piperidine-1-carboxylate::CHEMBL599731
SMILES OC(C1CCN(CC1)C(=O)Oc1ccc(cc1)[N+]([O-])=O)(c1ccc(Cl)cc1)c1ccc(Cl)cc1
InChI Key InChIKey=AAVLZBRYSUDDNJ-UHFFFAOYSA-N
Data  3 IC50
  Tab Delimited (TSV)   2D SDfile   Computed 3D by Vconf -m prep SDfile
Find this compound or compounds like it in BindingDB:
Activity Spreadsheet -- Enzyme Inhibition Constant Data from BindingDB
Found 3 hits for monomerid = 50307090
TargetFatty-acid amide hydrolase 1(Mus musculus (mouse))
The Scripps Research Institute
Curated by ChEMBL
LigandPNGBDBM50307090(4-Nitrophenyl 4-(Bis(4-chlorophenyl)(hydroxy)methy...)
Affinity DataIC50:  3.36E+3nM. Assay description: Inhibition of FAAH in mouse brain membrane
In DepthDetails ArticlePubMed
TargetMonoacylglycerol lipase ABHD6(Mus musculus (mouse))
The Scripps Research Institute
Curated by ChEMBL
LigandPNGBDBM50307090(4-Nitrophenyl 4-(Bis(4-chlorophenyl)(hydroxy)methy...)
Affinity DataIC50:  180nM. Assay description: Inhibition of ABHD6 in mouse brain membrane
In DepthDetails ArticlePubMed
TargetMonoglyceride lipase(Mus musculus (mouse))
The Scripps Research Institute
Curated by ChEMBL
LigandPNGBDBM50307090(4-Nitrophenyl 4-(Bis(4-chlorophenyl)(hydroxy)methy...)
Affinity DataIC50:  1.10E+3nM. Assay description: Inhibition of MAGL in mouse brain membrane
In DepthDetails ArticlePubMed