BDBM50307096 6-(2'-(METHYLSULFONYL)BIPHENYL-4-YL)-1-(3-(5-OXO-4,5-DIHYDRO-1H-1,2,4-TRIAZOL-3-YL)PHENYL)-3-(TRIFLUOROMETHYL)-5,6-DIHYDRO-1H-PYRAZOLO[3,4-C]PYRIDIN-7(4H)-ONE::6-(2'-(methylsulfonyl)biphenyl-4-yl)-1-(3-(5-oxo-4,5-dihydro-1H-1,2,4-triazol-3-yl)phenyl)-3-(trifluoromethyl)-3a,4,5,6-tetrahydro-1H-pyrazolo[3,4-c]pyridin-7(7aH)-one::CHEMBL578474
SMILES CS(=O)(=O)c1ccccc1-c1ccc(cc1)N1CCc2c(nn(c2C1=O)-c1cccc(c1)-c1n[nH]c(=O)[nH]1)C(F)(F)F
InChI Key InChIKey=LOIQROHBNJYIKB-UHFFFAOYSA-N
Data  2 KI
PDB links: 1 PDB ID matches this monomer.
  Tab Delimited (TSV)   2D SDfile   Computed 3D by Vconf -m prep SDfile
Find this compound or compounds like it in BindingDB:
Activity Spreadsheet -- Enzyme Inhibition Constant Data from BindingDB
Found 2 hits for monomerid = 50307096
TargetCoagulation factor X(Homo sapiens (Human))
Bristol-Myers Squibb
Curated by ChEMBL
LigandPNGBDBM50307096(6-(2'-(METHYLSULFONYL)BIPHENYL-4-YL)-1-(3-(5-OXO-4...)
Affinity DataKi:  2.20nM. Assay description: Inhibition of human factor 10a
TargetProthrombin(Homo sapiens (Human))
Bristol-Myers Squibb
Curated by ChEMBL
LigandPNGBDBM50307096(6-(2'-(METHYLSULFONYL)BIPHENYL-4-YL)-1-(3-(5-OXO-4...)
Affinity DataKi: >6.00E+3nM. Assay description: Inhibition of human factor 2a
In DepthDetails ArticlePubMed