BDBM50307226 3-[1-(4-Cyanobenzyl)-1H-imidazol-5-yl]-1-propanol::CHEMBL598399
SMILES OCCCc1cncn1Cc1ccc(cc1)C#N
InChI Key InChIKey=ACOYOVQVLSTOMH-UHFFFAOYSA-N
Data  2 IC50
  Tab Delimited (TSV)   2D SDfile   Computed 3D by Vconf -m prep SDfile
Find this compound or compounds like it in BindingDB:
Activity Spreadsheet -- Enzyme Inhibition Constant Data from BindingDB
Found 2 hits for monomerid = 50307226
TargetCytochrome P450 11B2, mitochondrial(Homo sapiens (Human))
Eindhoven University Of Technology
Curated by ChEMBL
LigandPNGBDBM50307226(3-[1-(4-Cyanobenzyl)-1H-imidazol-5-yl]-1-propanol ...)
Affinity DataIC50:  13nM. Assay description: Inhibition of human CYP11B2 expressed in chinese hamster V79 cells
In DepthDetails ArticlePubMed
TargetCytochrome P450 11B1, mitochondrial(Homo sapiens (Human))
Eindhoven University Of Technology
Curated by ChEMBL
LigandPNGBDBM50307226(3-[1-(4-Cyanobenzyl)-1H-imidazol-5-yl]-1-propanol ...)
Affinity DataIC50:  48nM. Assay description: Inhibition of human CYP11B1 expressed in chinese hamster V79 cells
In DepthDetails ArticlePubMed