BDBM50307374 CHEMBL589487::N-[(1S,2S,4R)-1-(3,5-difluorophenoxymethyl)-4-(4-fluoro-phenylcarbamoyl)-2-hydroxy-4-methoxy-butyl]-5-(methanesulfonyl-methyl-amino)-N'-((R)-1-phenyl-ethyl)-isophthalamide
SMILES CO[C@H](C[C@H](O)[C@H](COc1cc(F)cc(F)c1)NC(=O)c1cc(cc(c1)C(=O)N[C@H](C)c1ccccc1)N(C)CS(C)(=O)=O)C(=O)Nc1ccc(F)cc1
InChI Key InChIKey=HBJFNYFTLFFZDE-JCWYTBOMSA-N
Data  2 KI
  Tab Delimited (TSV)   2D SDfile   Computed 3D by Vconf -m prep SDfile
Find this compound or compounds like it in BindingDB:
Activity Spreadsheet -- Enzyme Inhibition Constant Data from BindingDB
Found 2 hits for monomerid = 50307374
TargetBeta-secretase 1(Homo sapiens (Human))
Stockholm University
Curated by ChEMBL
LigandPNGBDBM50307374(CHEMBL589487 | N-[(1S,2S,4R)-1-(3,5-difluorophenox...)
Affinity DataKi:  100nM. Assay description: Inhibition of human BACE1 expressed in Escherichia coli cells (BL21(DE3) by TRF assay
In DepthDetails ArticlePubMed
TargetCathepsin D(Homo sapiens (Human))
Stockholm University
Curated by ChEMBL
LigandPNGBDBM50307374(CHEMBL589487 | N-[(1S,2S,4R)-1-(3,5-difluorophenox...)
Affinity DataKi: >5.00E+3nM. Assay description: Inhibition of human liver cathepsin D
In DepthDetails ArticlePubMed