BDBM50307442 3-{2-({[1-(3,5-Dimethylphenyl)-3-methylbutyl]amino}-carbonyl)-4-[(4-methylphenoxy)methyl]phenyl}propanoic acid::CHEMBL599204
SMILES CC(C)CC(NC(=O)c1cc(COc2ccc(C)cc2)ccc1CCC(O)=O)c1cc(C)cc(C)c1
InChI Key InChIKey=FTAFMJDXEACGGN-UHFFFAOYSA-N
Data  1 KI  1 IC50
  Tab Delimited (TSV)   2D SDfile   Computed 3D by Vconf -m prep SDfile
Find this compound or compounds like it in BindingDB:
Activity Spreadsheet -- Enzyme Inhibition Constant Data from BindingDB
Found 2 hits for monomerid = 50307442
TargetProstaglandin E2 receptor EP3 subtype(Mus musculus (Mouse))
Minase Research Institute
Curated by ChEMBL
LigandPNGBDBM50307442(3-{2-({[1-(3,5-Dimethylphenyl)-3-methylbutyl]amino...)
Affinity DataKi:  0.670nM. Assay description: Displacement of [3H]PGE2 from mouse EP3 receptor expressed in CHO cell membrane
In DepthDetails ArticlePubMed
TargetProstaglandin E2 receptor EP3 subtype(Mus musculus (Mouse))
Minase Research Institute
Curated by ChEMBL
LigandPNGBDBM50307442(3-{2-({[1-(3,5-Dimethylphenyl)-3-methylbutyl]amino...)
Affinity DataIC50:  16nM. Assay description: Antagonist activity at mouse EP3 receptor expressed in CHO cells assessed as inhibition of PGE2-induced increase intracellular calcium level in prese...
In DepthDetails ArticlePubMed