BDBM50307526 CHEMBL604092::[8-(Cyclopentylamino)-1-methyl-4,5-dihydro-1H-pyrazolo[4,3-h]quinazolin-3-yl](4-methylpiperazin-1-yl)methanone
SMILES CN1CCN(CC1)C(=O)c1nn(C)c-2c1CCc1cnc(NC3CCCC3)nc-21
InChI Key InChIKey=ATQAEYOXBHLKNV-UHFFFAOYSA-N
Data  2 IC50
  Tab Delimited (TSV)   2D SDfile   Computed 3D by Vconf -m prep SDfile
Find this compound or compounds like it in BindingDB:
Activity Spreadsheet -- Enzyme Inhibition Constant Data from BindingDB
Found 2 hits for monomerid = 50307526
TargetAurora kinase A(Homo sapiens (Human))
Nerviano Medical Sciences
Curated by ChEMBL
LigandPNGBDBM50307526(CHEMBL604092 | [8-(Cyclopentylamino)-1-methyl-4,5-...)
Affinity DataIC50: >1.00E+4nM. Assay description: Inhibition of Aurora A
In DepthDetails ArticlePubMed
TargetCyclin-A1/Cyclin-A2/Cyclin-dependent kinase 2(Homo sapiens (Human))
Nerviano Medical Sciences
Curated by ChEMBL
LigandPNGBDBM50307526(CHEMBL604092 | [8-(Cyclopentylamino)-1-methyl-4,5-...)
Affinity DataIC50: >1.00E+4nM. Assay description: Inhibition of CDK2/Cyclin A
In DepthDetails ArticlePubMed