BDBM50307559 (4S)4-{[(4-{[(3-Aminopropoxy)carbonyl]amino}-6-phenylpyridin-2-yl)carbonyl]amino}-5-oxo-5-{4-[(pentyloxy)carbonyl]piperazin-1-yl}pentanoic acid::CHEMBL578507
SMILES CCCCCOC(=O)N1CCN(CC1)C(=O)[C@H](CCC(=O)OC(C)(C)C)NC(=O)c1cc(NC(=O)OCCCN)cc(n1)-c1ccccc1
InChI Key InChIKey=ORRNLORMNOHOMN-MHZLTWQESA-N
Data  1 KI
  Tab Delimited (TSV)   2D SDfile   Computed 3D by Vconf -m prep SDfile
Find this compound or compounds like it in BindingDB:
Activity Spreadsheet -- Enzyme Inhibition Constant Data from BindingDB
Found 1 hit for monomerid = 50307559
TargetP2Y purinoceptor 12(Homo sapiens (Human))
Pfizer
Curated by ChEMBL
LigandPNGBDBM50307559((4S)4-{[(4-{[(3-Aminopropoxy)carbonyl]amino}-6-phe...)
Affinity DataKi:  1.90nM. Assay description: Displacement of [33P]ADP from human recombinant P2Y12 receptor expressed in CHO cells
In DepthDetails ArticlePubMed