BDBM50307646 (4S)5-(4-Benzoylpiperazin-1-yl)5-oxo-4-{[(6-phenylpyridin-2-yl)carbonyl]amino}pentanoic acid::CHEMBL596962
SMILES CC(C)(C)OC(=O)CC[C@H](NC(=O)c1cccc(n1)-c1ccccc1)C(=O)N1CCN(CC1)C(=O)c1ccccc1
InChI Key InChIKey=TYOLJBMGLGYHJQ-MHZLTWQESA-N
Data  1 KI
  Tab Delimited (TSV)   2D SDfile   Computed 3D by Vconf -m prep SDfile
Find this compound or compounds like it in BindingDB:
Activity Spreadsheet -- Enzyme Inhibition Constant Data from BindingDB
Found 1 hit for monomerid = 50307646
TargetP2Y purinoceptor 12(Homo sapiens (Human))
Pfizer
Curated by ChEMBL
LigandPNGBDBM50307646((4S)5-(4-Benzoylpiperazin-1-yl)5-oxo-4-{[(6-phenyl...)
Affinity DataKi:  1.88E+3nM. Assay description: Displacement of [33P]ADP from human recombinant P2Y12 receptor expressed in CHO cells
In DepthDetails ArticlePubMed