BDBM50307731 (4S)5-[4-(Butoxycarbonyl)iperazin-1-yl]-4-({[4-(3-hydroxypropoxy)6-phenylpyridin-2-yl]carbonyl}amino)5-oxopentanoicAcid::CHEMBL599637
SMILES CCCCOC(=O)N1CCN(CC1)C(=O)[C@H](CCC(O)=O)NC(=O)c1cc(OCCCO)cc(n1)-c1ccccc1
InChI Key InChIKey=KNLKSDKIXOPILM-QHCPKHFHSA-N
Data  1 KI
  Tab Delimited (TSV)   2D SDfile   Computed 3D by Vconf -m prep SDfile
Find this compound or compounds like it in BindingDB:
Activity Spreadsheet -- Enzyme Inhibition Constant Data from BindingDB
Found 1 hit for monomerid = 50307731
TargetP2Y purinoceptor 12(Homo sapiens (Human))
Pfizer
Curated by ChEMBL
LigandPNGBDBM50307731((4S)5-[4-(Butoxycarbonyl)iperazin-1-yl]-4-({[4-(3-...)
Affinity DataKi:  6.90nM. Assay description: Displacement of [33P]ADP from human recombinant P2Y12 receptor expressed in CHO cells
In DepthDetails ArticlePubMed