BDBM50307822 6-Methoxy-1-methyl-N-[(3-endo)-9-methyl-9-azabicyclo[3.3.1]non-3-yl]-1H-indazole-3-carboxamide::CHEMBL596758
SMILES COc1ccc2c(nn(C)c2c1)C(=O)NC1C[C@@H]2CCC[C@@H](C1)N2C
InChI Key InChIKey=HKZXJCJPMIJTDL-KBPBESRZSA-N
Data  1 KI
  Tab Delimited (TSV)   2D SDfile   Computed 3D by Vconf -m prep SDfile
Find this compound or compounds like it in BindingDB:
Activity Spreadsheet -- Enzyme Inhibition Constant Data from BindingDB
Found 1 hit for monomerid = 50307822
Target5-hydroxytryptamine receptor 3A(Homo sapiens (Human))
University Of Warwick
Curated by ChEMBL
LigandPNGBDBM50307822(6-Methoxy-1-methyl-N-[(3-endo)-9-methyl-9-azabicyc...)
Affinity DataKi:  237nM. Assay description: Displacement of [3H]granisetron from human 5HT3A receptor expressed in HEK293 cells by scintillation counting
In DepthDetails ArticlePubMed