BDBM50307951 (4-Amino-1-(7H-pyrrolo[2,3-d]pyrimidin-4-yl)piperidin-4-yl)-(3,4-dihydroisoquinolin-2(1H)-yl)methanone::CHEMBL596990
SMILES NC1(CCN(CC1)c1ncnc2[nH]ccc12)C(=O)N1CCc2ccccc2C1
InChI Key InChIKey=CSTDSVVCQOQNIL-UHFFFAOYSA-N
Data  1 IC50
  Tab Delimited (TSV)   2D SDfile   Computed 3D by Vconf -m prep SDfile
Find this compound or compounds like it in BindingDB:
Activity Spreadsheet -- Enzyme Inhibition Constant Data from BindingDB
Found 1 hit for monomerid = 50307951
TargetRAC-beta serine/threonine-protein kinase(Homo sapiens (Human))
The Institute Of Cancer Research
Curated by ChEMBL
LigandPNGBDBM50307951((4-Amino-1-(7H-pyrrolo[2,3-d]pyrimidin-4-yl)piperi...)
Affinity DataIC50:  250nM. Assay description: Inhibition of PKBbeta by radiometric filter binding assay
In DepthDetails ArticlePubMed