BDBM50307953 4-(2-Methoxybenzyl)-1-(7H-pyrrolo[2,3-d]pyrimidin-4-yl)piperidin-4-amine::CHEMBL597008
SMILES COc1ccccc1CC1(N)CCN(CC1)c1ncnc2[nH]ccc12
InChI Key InChIKey=MCIJUINXWSCPSG-UHFFFAOYSA-N
Data  1 IC50
  Tab Delimited (TSV)   2D SDfile   Computed 3D by Vconf -m prep SDfile
Find this compound or compounds like it in BindingDB:
Activity Spreadsheet -- Enzyme Inhibition Constant Data from BindingDB
Found 1 hit for monomerid = 50307953
TargetRAC-beta serine/threonine-protein kinase(Homo sapiens (Human))
The Institute Of Cancer Research
Curated by ChEMBL
LigandPNGBDBM50307953(4-(2-Methoxybenzyl)-1-(7H-pyrrolo[2,3-d]pyrimidin-...)
Affinity DataIC50: >1.00E+3nM. Assay description: Inhibition of PKBbeta by radiometric filter binding assay
In DepthDetails ArticlePubMed