BDBM50308018 2-Methyl-3-[4-(4-chlorophenyl)piperazinylmethyl]imidazo-[1,2-a]-pyridine::CHEMBL597007
SMILES Cc1nc2ccccn2c1CN1CCN(CC1)c1ccc(Cl)cc1
InChI Key InChIKey=KPTAMQXXLRVOOO-UHFFFAOYSA-N
Data  2 KI
  Tab Delimited (TSV)   2D SDfile   Computed 3D by Vconf -m prep SDfile
Find this compound or compounds like it in BindingDB:
Activity Spreadsheet -- Enzyme Inhibition Constant Data from BindingDB
Found 2 hits for monomerid = 50308018
Target5-hydroxytryptamine receptor 2A(Rattus norvegicus (rat))
Universidade Federal Do Rio Grande Do Sul
Curated by ChEMBL
LigandPNGBDBM50308018(2-Methyl-3-[4-(4-chlorophenyl)piperazinylmethyl]im...)
Affinity DataKi:  4.92E+3nM. Assay description: Displacement of [3H]ketanserin from 5HT2A receptor in Wistar rat cortex homogenate
In DepthDetails ArticlePubMed
Target5-hydroxytryptamine receptor 1A(Rattus norvegicus (rat))
Universidade Federal Do Rio Grande Do Sul
Curated by ChEMBL
LigandPNGBDBM50308018(2-Methyl-3-[4-(4-chlorophenyl)piperazinylmethyl]im...)
Affinity DataKi: >1.33E+4nM. Assay description: Displacement of [3H]-8-OH-DPAT from 5HT1A receptor in Wistar rat hippocampus homogenate
In DepthDetails ArticlePubMed