BDBM50308080 1-Benzyl-4-(4-isopropyl-phenyl)-6-propargyloxy-1H-quinazolin-2-one::CHEMBL591475
SMILES CC(C)c1ccc(cc1)-c1nc(=O)n(Cc2ccccc2)c2ccc(OCC#C)cc12
InChI Key InChIKey=WXYYACUWOMKZQC-UHFFFAOYSA-N
Data  1 IC50
  Tab Delimited (TSV)   2D SDfile   Computed 3D by Vconf -m prep SDfile
Find this compound or compounds like it in BindingDB:
Activity Spreadsheet -- Enzyme Inhibition Constant Data from BindingDB
Found 1 hit for monomerid = 50308080
TargetExtracellular calcium-sensing receptor(Homo sapiens (Human))
Novartis Institutes For Biomedical Research
Curated by ChEMBL
LigandPNGBDBM50308080(1-Benzyl-4-(4-isopropyl-phenyl)-6-propargyloxy-1H-...)
Affinity DataIC50:  4.40nM. Assay description: Antagonist activity at human CaSR expressed in CCL39 cells assessed as inhibition of extracellular calcium-induced intracellular calcium transient by...
In DepthDetails ArticlePubMed