BDBM50308278 2-Chloro-5-(S-2-fluoroethyl)thioaniline::CHEMBL610219
SMILES COc1ccc2C(=O)\C(Cc2c1)=C\c1ccc(CN(C)Cc2ccccc2)cc1
InChI Key InChIKey=OITQYDGXLMDJCV-OEAKJJBVSA-N
Data  2 IC50
  Tab Delimited (TSV)   2D SDfile   Computed 3D by Vconf -m prep SDfile
Find this compound or compounds like it in BindingDB:
Activity Spreadsheet -- Enzyme Inhibition Constant Data from BindingDB
Found 2 hits for monomerid = 50308278
TargetAcetylcholinesterase(Homo sapiens (Human))
University Of Bologna
Curated by ChEMBL
LigandPNGBDBM50308278(2-Chloro-5-(S-2-fluoroethyl)thioaniline | CHEMBL61...)
Affinity DataIC50:  2.87E+4nM. Assay description: Inhibition of human recombinant AChE preincubated for 20 mins before substrate addition by Ellman's method
In DepthDetails ArticlePubMed
TargetCholinesterase(Homo sapiens (Human))
University Of Bologna
Curated by ChEMBL
LigandPNGBDBM50308278(2-Chloro-5-(S-2-fluoroethyl)thioaniline | CHEMBL61...)
Affinity DataIC50:  2.11E+4nM. Assay description: Inhibition of human BuChE preincubated for 20 mins before substrate addition by Ellman's method
In DepthDetails ArticlePubMed