BDBM50308416 CHEMBL590511::Morpholino(1'H-phenothiazin-1'-yl)methanone
SMILES O=C(N1CCOCC1)N1c2ccccc2Sc2ccccc12
InChI Key InChIKey=PWLGMYUBQYNSQV-UHFFFAOYSA-N
Data  1 KI
  Tab Delimited (TSV)   2D SDfile   Computed 3D by Vconf -m prep SDfile
Find this compound or compounds like it in BindingDB:
Activity Spreadsheet -- Enzyme Inhibition Constant Data from BindingDB
Found 1 hit for monomerid = 50308416
TargetCholinesterase(Homo sapiens (Human))
Dalhousie University
Curated by ChEMBL
LigandPNGBDBM50308416(CHEMBL590511 | Morpholino(1'H-phenothiazin-1'-yl)m...)
Affinity DataKi:  7.10E+3nM. Assay description: Inhibition of human plasma BuChE by modified Ellman's spectrophotometric method
In DepthDetails ArticlePubMed