BDBM50308419 CHEMBL589536::N-[2-(Pyrrolidinyl)ethyl]-10H-phenothiazine-10-carboxamide
SMILES O=C(NCCN1CCCC1)N1c2ccccc2Sc2ccccc12
InChI Key InChIKey=DUFNIJJWDMNBKO-UHFFFAOYSA-N
Data  2 KI
  Tab Delimited (TSV)   2D SDfile   Computed 3D by Vconf -m prep SDfile
Find this compound or compounds like it in BindingDB:
Activity Spreadsheet -- Enzyme Inhibition Constant Data from BindingDB
Found 2 hits for monomerid = 50308419
TargetCholinesterase(Homo sapiens (Human))
Dalhousie University
Curated by ChEMBL
LigandPNGBDBM50308419(CHEMBL589536 | N-[2-(Pyrrolidinyl)ethyl]-10H-pheno...)
Affinity DataKi:  210nM. Assay description: Inhibition of human plasma BuChE by modified Ellman's spectrophotometric method
In DepthDetails ArticlePubMed
TargetAcetylcholinesterase(Homo sapiens (Human))
Dalhousie University
Curated by ChEMBL
LigandPNGBDBM50308419(CHEMBL589536 | N-[2-(Pyrrolidinyl)ethyl]-10H-pheno...)
Affinity DataKi:  2.94E+4nM. Assay description: Inhibition of human recombinant AChE by modified Ellman's spectrophotometric method
In DepthDetails ArticlePubMed