BDBM50308503 (4-Methoxyphenyl)(2-(methylamino)-4-phenylthiazol-5-yl)methanone::CHEMBL590024
SMILES CNc1nc(c(s1)C(=O)c1ccc(OC)cc1)-c1ccccc1
InChI Key InChIKey=BGYXBDWCLAKHEF-UHFFFAOYSA-N
Data  4 KI
  Tab Delimited (TSV)   2D SDfile   Computed 3D by Vconf -m prep SDfile
Find this compound or compounds like it in BindingDB:
Activity Spreadsheet -- Enzyme Inhibition Constant Data from BindingDB
Found 4 hits for monomerid = 50308503
TargetAdenosine receptor A2a(Rattus norvegicus (rat))
University Of Bonn
Curated by ChEMBL
LigandPNGBDBM50308503((4-Methoxyphenyl)(2-(methylamino)-4-phenylthiazol-...)
Affinity DataKi: >1.00E+3nM. Assay description: Displacement of [3H]MSX2 from adenosine A2A receptor in rat brain striatum membrane
In DepthDetails ArticlePubMed
TargetAdenosine receptor A2b(Homo sapiens (Human))
University Of Bonn
Curated by ChEMBL
LigandPNGBDBM50308503((4-Methoxyphenyl)(2-(methylamino)-4-phenylthiazol-...)
Affinity DataKi: >1.00E+3nM. Assay description: Displacement of [3H]PSB-603 from human adenosine A2B receptor expressed in CHO cells
In DepthDetails ArticlePubMed
TargetAdenosine receptor A3(Homo sapiens (Human))
University Of Bonn
Curated by ChEMBL
LigandPNGBDBM50308503((4-Methoxyphenyl)(2-(methylamino)-4-phenylthiazol-...)
Affinity DataKi: >1.00E+3nM. Assay description: Binding affinity to human adenosine A3 receptor
In DepthDetails ArticlePubMed
TargetAdenosine receptor A1(Rattus norvegicus (rat))
University Of Bonn
Curated by ChEMBL
LigandPNGBDBM50308503((4-Methoxyphenyl)(2-(methylamino)-4-phenylthiazol-...)
Affinity DataKi: >1.00E+3nM. Assay description: Displacement of [3H]CCPA from adenosine A1 receptor in rat brain cortex membrane
In DepthDetails ArticlePubMed