BDBM50308611 2-(2-(4-Chlorobenzylidene)hydrazinyl)thiazol-4(5H)-one::CHEMBL589823
SMILES Oc1csc(N=NCc2ccc(Cl)cc2)n1
InChI Key InChIKey=MWKBSAYARBSHAB-UHFFFAOYSA-N
Data  2 IC50
  Tab Delimited (TSV)   2D SDfile   Computed 3D by Vconf -m prep SDfile
Find this compound or compounds like it in BindingDB:
Activity Spreadsheet -- Enzyme Inhibition Constant Data from BindingDB
Found 2 hits for monomerid = 50308611
TargetReceptor tyrosine-protein kinase erbB-2(Homo sapiens (Human))
Nanjing University
Curated by ChEMBL
LigandPNGBDBM50308611(2-(2-(4-Chlorobenzylidene)hydrazinyl)thiazol-4(5H)...)
Affinity DataIC50:  2.75E+3nM. Assay description: Inhibition of human cloned HER2 autophosphorylation expressed in baculovirus-infected Sf9 cells by solid-phase ELISA
In DepthDetails ArticlePubMed
TargetEpidermal growth factor receptor(Homo sapiens (Human))
Nanjing University
Curated by ChEMBL
LigandPNGBDBM50308611(2-(2-(4-Chlorobenzylidene)hydrazinyl)thiazol-4(5H)...)
Affinity DataIC50:  1.94E+3nM. Assay description: Inhibition of cloned EGFR autophosphorylation expressed in baculovirus-infected Sf9 cells by solid-phase ELISA
In DepthDetails ArticlePubMed