BDBM50308637 1-(3,5-Dibromo-2-hydroxybenzyl)-1-(4-hydroxybenzyl)-3-phenylurea::CHEMBL601828
SMILES Oc1ccc(CN(Cc2cc(Br)cc(Br)c2O)C(=O)Nc2ccccc2)cc1
InChI Key InChIKey=YSWRUZSGHZDWJW-UHFFFAOYSA-N
Data  3 IC50
  Tab Delimited (TSV)   2D SDfile   Computed 3D by Vconf -m prep SDfile
Find this compound or compounds like it in BindingDB:
Activity Spreadsheet -- Enzyme Inhibition Constant Data from BindingDB
Found 3 hits for monomerid = 50308637
TargetReceptor tyrosine-protein kinase erbB-2(Homo sapiens (Human))
Nanjing University
Curated by ChEMBL
LigandPNGBDBM50308637(1-(3,5-Dibromo-2-hydroxybenzyl)-1-(4-hydroxybenzyl...)
Affinity DataIC50:  4.53E+3nM. Assay description: Inhibition of human cloned HER2 autophosphorylation expressed in baculovirus-infected Sf9 cells by solid-phase ELISA
In DepthDetails ArticlePubMed
TargetReceptor tyrosine-protein kinase erbB-2(Homo sapiens (Human))
Nanjing University
Curated by ChEMBL
LigandPNGBDBM50308637(1-(3,5-Dibromo-2-hydroxybenzyl)-1-(4-hydroxybenzyl...)
Affinity DataIC50:  4.50E+3nM. Assay description: Inhibition of HER2 (unknown origin) by ELISA
In DepthDetails ArticlePubMed
TargetEpidermal growth factor receptor(Homo sapiens (Human))
Nanjing University
Curated by ChEMBL
LigandPNGBDBM50308637(1-(3,5-Dibromo-2-hydroxybenzyl)-1-(4-hydroxybenzyl...)
Affinity DataIC50:  1.12E+3nM. Assay description: Inhibition of cloned EGFR autophosphorylation expressed in baculovirus-infected Sf9 cells by solid-phase ELISA
In DepthDetails ArticlePubMed