BDBM50309002 CHEMBL609157::N-((5'-chloro-3,3'-difluoro-2'-(2-methyl-2H-tetrazol-5-yl)biphenyl-4-yl)methyl)-1-ethyl-2-(3-methoxyisoxazole-5-carbonyl)hydrazinecarboxamide
SMILES CCN(NC(=O)c1cc(OC)no1)C(=O)NCc1ccc(cc1F)-c1cc(Cl)cc(F)c1-c1nnn(C)n1
InChI Key InChIKey=BSTTUUBZUYRDAK-UHFFFAOYSA-N
Data  1 IC50
  Tab Delimited (TSV)   2D SDfile   Computed 3D by Vconf -m prep SDfile
Find this compound or compounds like it in BindingDB:
Activity Spreadsheet -- Enzyme Inhibition Constant Data from BindingDB
Found 1 hit for monomerid = 50309002
TargetB1 bradykinin receptor(Homo sapiens (Human))
Jerini
Curated by ChEMBL
LigandPNGBDBM50309002(CHEMBL609157 | N-((5'-chloro-3,3'-difluoro-2'-(2-m...)
Affinity DataIC50:  0.130nM. Assay description: Antagonist activity at bradikinin B1 receptor in human IMR90 cells assessed as inhibition of des-Arg-bradykinin-mediated calcium mobilization
In DepthDetails ArticlePubMed