BDBM50309019 CHEMBL603657::methyl 3,3'-difluoro-4'-((1-oxoisoindolin-2-yl)methyl)biphenyl-2-carboxylate
SMILES COC(=O)c1c(F)cccc1-c1ccc(CN2Cc3ccccc3C2=O)c(F)c1
InChI Key InChIKey=KPHPLMZRRZERMW-UHFFFAOYSA-N
Data  1 IC50
  Tab Delimited (TSV)   2D SDfile   Computed 3D by Vconf -m prep SDfile
Find this compound or compounds like it in BindingDB:
Activity Spreadsheet -- Enzyme Inhibition Constant Data from BindingDB
Found 1 hit for monomerid = 50309019
TargetB1 bradykinin receptor(Homo sapiens (Human))
Jerini
Curated by ChEMBL
LigandPNGBDBM50309019(CHEMBL603657 | methyl 3,3'-difluoro-4'-((1-oxoisoi...)
Affinity DataIC50:  6.10E+3nM. Assay description: Antagonist activity at bradykinin B1 receptor in human IMR90 cells pretreated with IL1beta assessed as inhibition of DAKD-induced calcium mobilizatio...
In DepthDetails ArticlePubMed