BDBM50309025 CHEMBL603668::N-(4-((5'-chloro-3,3'-difluoro-2'-(5-methyl-1,2,4-oxadiazol-3-yl)biphenyl-4-yl)methylamino)-1,2,5-oxadiazol-3-yl)-3-methoxyisoxazole-5-carboxamide
SMILES COc1cc(on1)C(=O)Nc1nonc1NCc1ccc(cc1F)-c1cc(Cl)cc(F)c1-c1noc(C)n1
InChI Key InChIKey=WEVILATZZMPFBJ-UHFFFAOYSA-N
Data  1 IC50
  Tab Delimited (TSV)   2D SDfile   Computed 3D by Vconf -m prep SDfile
Find this compound or compounds like it in BindingDB:
Activity Spreadsheet -- Enzyme Inhibition Constant Data from BindingDB
Found 1 hit for monomerid = 50309025
TargetB1 bradykinin receptor(Homo sapiens (Human))
Jerini
Curated by ChEMBL
LigandPNGBDBM50309025(CHEMBL603668 | N-(4-((5'-chloro-3,3'-difluoro-2'-(...)
Affinity DataIC50:  1nM. Assay description: Antagonist activity at bradykinin B1 receptor in human IMR90 cells pretreated with IL1beta assessed as inhibition of DAKD-induced calcium mobilizatio...
In DepthDetails ArticlePubMed