BDBM50309061 CHEMBL591541::N-(((3R,6S)-1-(4-chlorophenyl)-6-(2,4-dichlorophenyl)piperidin-3-yl)methyl)naphthalene-1-sulfonamide
SMILES Clc1ccc(cc1)N1C[C@H](CNS(=O)(=O)c2cccc3ccccc23)CC[C@H]1c1ccc(Cl)cc1Cl
InChI Key InChIKey=WTNGNGPNUACNSV-PPHZAIPVSA-N
Data  1 KI
  Tab Delimited (TSV)   2D SDfile   Computed 3D by Vconf -m prep SDfile
Find this compound or compounds like it in BindingDB:
Activity Spreadsheet -- Enzyme Inhibition Constant Data from BindingDB
Found 1 hit for monomerid = 50309061
TargetCannabinoid receptor 1(Homo sapiens (Human))
Merck Research Laboratories
Curated by ChEMBL
LigandPNGBDBM50309061(CHEMBL591541 | N-(((3R,6S)-1-(4-chlorophenyl)-6-(2...)
Affinity DataKi:  2.30nM. Assay description: Binding affinity to human CB1 receptor
In DepthDetails ArticlePubMed