BDBM50309231 6-(3-(4-(1-(dimethylamino)cyclopropanecarbonyl)piperazine-1-carbonyl)-4-fluorobenzyl)-4,5-dimethylpyridazin-3(2H)-one::CHEMBL591528
SMILES CN(C)C1(CC1)C(=O)N1CCN(CC1)C(=O)c1cc(Cc2n[nH]c(=O)c(C)c2C)ccc1F
InChI Key InChIKey=WAVBTKPDIZFGSX-UHFFFAOYSA-N
Data  1 IC50
  Tab Delimited (TSV)   2D SDfile   Computed 3D by Vconf -m prep SDfile
Find this compound or compounds like it in BindingDB:
Activity Spreadsheet -- Enzyme Inhibition Constant Data from BindingDB
Found 1 hit for monomerid = 50309231
TargetPoly [ADP-ribose] polymerase 1(Homo sapiens (Human))
Merck Research Laboratories
Curated by ChEMBL
LigandPNGBDBM50309231(6-(3-(4-(1-(dimethylamino)cyclopropanecarbonyl)pip...)
Affinity DataIC50:  5.70nM. Assay description: Inhibition of PARP1
In DepthDetails ArticlePubMed