BDBM50309291 2-(2-((4-chlorophenyl)(phenyl)methyl)-4-(4-fluorophenyl)thiazol-5-yl)acetic acid::CHEMBL599568
SMILES OC(=O)Cc1sc(nc1-c1ccc(F)cc1)C(c1ccccc1)c1ccc(Cl)cc1
InChI Key InChIKey=RAJBDMPVCAZUIO-UHFFFAOYSA-N
Data  2 IC50
  Tab Delimited (TSV)   2D SDfile   Computed 3D by Vconf -m prep SDfile
Find this compound or compounds like it in BindingDB:
Activity Spreadsheet -- Enzyme Inhibition Constant Data from BindingDB
Found 2 hits for monomerid = 50309291
TargetProstaglandin D2 receptor 2(Homo sapiens (Human))
7Tm Pharma
Curated by ChEMBL
LigandPNGBDBM50309291(2-(2-((4-chlorophenyl)(phenyl)methyl)-4-(4-fluorop...)
Affinity DataIC50:  79nM. Assay description: Antagonist activity at human CRTH2 receptor expressed in HEK285-7 cells assessed as inhibition of beta arrestin translocation by bioluminescence reso...
In DepthDetails ArticlePubMed
TargetProstaglandin D2 receptor 2(Homo sapiens (Human))
7Tm Pharma
Curated by ChEMBL
LigandPNGBDBM50309291(2-(2-((4-chlorophenyl)(phenyl)methyl)-4-(4-fluorop...)
Affinity DataIC50:  14nM. Assay description: Displacement of[3H]PGD2 from human CRTH2 receptor expressed in HEK385-7 cells
In DepthDetails ArticlePubMed