BDBM50309406 2-(2-((3'-cyanobiphenyl-2-yl)methyl)-4-(4-fluorophenyl)thiazol-5-yl)acetic acid::CHEMBL603187
SMILES OC(=O)Cc1sc(Cc2ccccc2-c2cccc(c2)C#N)nc1-c1ccc(F)cc1
InChI Key InChIKey=SYRMYDRBDXUBHO-UHFFFAOYSA-N
Data  2 IC50
  Tab Delimited (TSV)   2D SDfile   Computed 3D by Vconf -m prep SDfile
Find this compound or compounds like it in BindingDB:
Activity Spreadsheet -- Enzyme Inhibition Constant Data from BindingDB
Found 2 hits for monomerid = 50309406
TargetProstaglandin D2 receptor 2(Homo sapiens (Human))
7Tm Pharma
Curated by ChEMBL
LigandPNGBDBM50309406(2-(2-((3'-cyanobiphenyl-2-yl)methyl)-4-(4-fluoroph...)
Affinity DataIC50:  340nM. Assay description: Displacement of[3H]PGD2 from human CRTH2 receptor expressed in african green monkey COS7 cells
In DepthDetails ArticlePubMed
TargetProstaglandin D2 receptor 2(Homo sapiens (Human))
7Tm Pharma
Curated by ChEMBL
LigandPNGBDBM50309406(2-(2-((3'-cyanobiphenyl-2-yl)methyl)-4-(4-fluoroph...)
Affinity DataIC50: >1.00E+5nM. Assay description: Antagonist activity at human CRTH2 receptor expressed in HEK285-7 cells assessed as inhibition of beta arrestin translocation by bioluminescence reso...
In DepthDetails ArticlePubMed