BDBM50309430 2-(4-(4-chlorophenyl)-2-(2-methoxyphenylamino)thiazol-5-yl)acetic acid::CHEMBL599879
SMILES COc1ccccc1Nc1nc(c(CC(O)=O)s1)-c1ccc(Cl)cc1
InChI Key InChIKey=DYKPYWVCIMAHOU-UHFFFAOYSA-N
Data  2 IC50
  Tab Delimited (TSV)   2D SDfile   Computed 3D by Vconf -m prep SDfile
Find this compound or compounds like it in BindingDB:
Activity Spreadsheet -- Enzyme Inhibition Constant Data from BindingDB
Found 2 hits for monomerid = 50309430
TargetProstaglandin D2 receptor 2(Homo sapiens (Human))
7Tm Pharma
Curated by ChEMBL
LigandPNGBDBM50309430(2-(4-(4-chlorophenyl)-2-(2-methoxyphenylamino)thia...)
Affinity DataIC50:  730nM. Assay description: Antagonist activity at human CRTH2 receptor expressed in HEK285-7 cells assessed as inhibition of beta arrestin translocation by bioluminescence reso...
In DepthDetails ArticlePubMed
TargetProstaglandin D2 receptor 2(Homo sapiens (Human))
7Tm Pharma
Curated by ChEMBL
LigandPNGBDBM50309430(2-(4-(4-chlorophenyl)-2-(2-methoxyphenylamino)thia...)
Affinity DataIC50:  450nM. Assay description: Displacement of[3H]PGD2 from human CRTH2 receptor expressed in african green monkey COS7 cells
In DepthDetails ArticlePubMed