BDBM50309511 3-(piperidin-4-yl)-2-(2-(trifluoromethyl)phenoxy)pyridine::CHEMBL596715
SMILES FC(F)(F)c1ccccc1Oc1ncccc1C1CCNCC1
InChI Key InChIKey=ZWJLIFWNALUYLT-UHFFFAOYSA-N
Data  4 KI
  Tab Delimited (TSV)   2D SDfile   Computed 3D by Vconf -m prep SDfile
Find this compound or compounds like it in BindingDB:
Activity Spreadsheet -- Enzyme Inhibition Constant Data from BindingDB
Found 4 hits for monomerid = 50309511
Target5-hydroxytryptamine receptor 1A(Homo sapiens (Human))
Pfizer
Curated by ChEMBL
LigandPNGBDBM50309511(3-(piperidin-4-yl)-2-(2-(trifluoromethyl)phenoxy)p...)
Affinity DataKi:  71nM. Assay description: Displacement of [3H]8-OH-DPAT from human cloned 5HT1A receptor by filtration techniques
In DepthDetails ArticlePubMed
TargetSodium-dependent noradrenaline transporter(Homo sapiens (Human))
Pfizer
Curated by ChEMBL
LigandPNGBDBM50309511(3-(piperidin-4-yl)-2-(2-(trifluoromethyl)phenoxy)p...)
Affinity DataKi:  140nM. Assay description: Displacement of [3H]nisoxetine from human NET expressed in HEK293 cells by scintillation proximity assay
In DepthDetails ArticlePubMed
TargetSodium-dependent serotonin transporter(Homo sapiens (Human))
Pfizer
Curated by ChEMBL
LigandPNGBDBM50309511(3-(piperidin-4-yl)-2-(2-(trifluoromethyl)phenoxy)p...)
Affinity DataKi:  203nM. Assay description: Displacement of [3H]citalopram from human SERT expressed in HEK293 cells by scintillation proximity assay
In DepthDetails ArticlePubMed
TargetSodium-dependent dopamine transporter(Homo sapiens (Human))
Pfizer
Curated by ChEMBL
LigandPNGBDBM50309511(3-(piperidin-4-yl)-2-(2-(trifluoromethyl)phenoxy)p...)
Affinity DataKi:  6.65E+3nM. Assay description: Displacement of [3H]WIN35428 from human DAT expressed in HEK293 cells by scintillation proximity assay
In DepthDetails ArticlePubMed