BDBM50309979 4-((1H-1,2,4-Triazol-1-yl)methyl)-N-(1-(4-bromophenyl)ethyl)-5-(4-chlorophenyl)-1-(2,4-dichlorophenyl)-1H-pyrazole-3-carboxamide::CHEMBL597828
SMILES Cc1cc(Br)ccc1CNC(=O)c1nn(c(c1Cn1cncn1)-c1ccc(Cl)cc1)-c1ccc(Cl)cc1Cl
InChI Key InChIKey=KVFHWJSUFIITRI-UHFFFAOYSA-N
Data  1 IC50
  Tab Delimited (TSV)   2D SDfile   Computed 3D by Vconf -m prep SDfile
Find this compound or compounds like it in BindingDB:
Activity Spreadsheet -- Enzyme Inhibition Constant Data from BindingDB
Found 1 hit for monomerid = 50309979
TargetCannabinoid receptor 1(Rattus norvegicus (rat))
Green Cross
Curated by ChEMBL
LigandPNGBDBM50309979(4-((1H-1,2,4-Triazol-1-yl)methyl)-N-(1-(4-bromophe...)
Affinity DataIC50:  2.60nM. Assay description: Displacement of [3H]CP55,940 from CB1 receptor in Sprague-Dawley rat cerebellar membrane
In DepthDetails ArticlePubMed