BDBM50309991 4-((1H-1,2,4-Triazol-1-yl)methyl)-1-(2-chlorophenyl)-5-(4-chlorophenyl)-N-(1-(4-chlorophenyl)cyclopropyl)-1H-pyrazole-3-carboxamide::CHEMBL597519
SMILES Clc1ccc(cc1)-c1c(Cn2cncn2)c(nn1-c1ccccc1Cl)C(=O)NC1(CC1)c1ccc(Cl)cc1
InChI Key InChIKey=BSABSBLCOUASAU-UHFFFAOYSA-N
Data  1 IC50
  Tab Delimited (TSV)   2D SDfile   Computed 3D by Vconf -m prep SDfile
Find this compound or compounds like it in BindingDB:
Activity Spreadsheet -- Enzyme Inhibition Constant Data from BindingDB
Found 1 hit for monomerid = 50309991
TargetCannabinoid receptor 1(Rattus norvegicus (rat))
Green Cross
Curated by ChEMBL
LigandPNGBDBM50309991(4-((1H-1,2,4-Triazol-1-yl)methyl)-1-(2-chloropheny...)
Affinity DataIC50:  9.03nM. Assay description: Displacement of [3H]CP55,940 from CB1 receptor in Sprague-Dawley rat cerebellar membrane
In DepthDetails ArticlePubMed