BDBM50309992 4-((1H-1,2,4-Triazol-1-yl)methyl)-N-benzyl-5-(4-bromophenyl)-1-(2,4-dichlorophenyl)-1H-pyrazole-3-carboxamide::CHEMBL604933
SMILES Clc1ccc(c(Cl)c1)-n1nc(C(=O)NCc2ccccc2)c(Cn2cncn2)c1-c1ccc(Br)cc1
InChI Key InChIKey=GZMONWXYMYEMLO-UHFFFAOYSA-N
Data  1 IC50
  Tab Delimited (TSV)   2D SDfile   Computed 3D by Vconf -m prep SDfile
Find this compound or compounds like it in BindingDB:
Activity Spreadsheet -- Enzyme Inhibition Constant Data from BindingDB
Found 1 hit for monomerid = 50309992
TargetCannabinoid receptor 1(Rattus norvegicus (rat))
Green Cross
Curated by ChEMBL
LigandPNGBDBM50309992(4-((1H-1,2,4-Triazol-1-yl)methyl)-N-benzyl-5-(4-br...)
Affinity DataIC50:  13nM. Assay description: Displacement of [3H]CP55,940 from CB1 receptor in Sprague-Dawley rat cerebellar membrane
In DepthDetails ArticlePubMed