BDBM50310184 7,4'-dimethoxyflavone::7-Methoxy-2-(4-methoxy-phenyl)-chromen-4-one::7-methoxy-2-(4-methoxyphenyl)-4H-chromen-4-one::CHEMBL16442
SMILES COc1ccc(cc1)-c1cc(=O)c2ccc(OC)cc2o1
InChI Key InChIKey=LGTXUFBDCDFQIU-UHFFFAOYSA-N
Data  1 IC50
  Tab Delimited (TSV)   2D SDfile   Computed 3D by Vconf -m prep SDfile
Find this compound or compounds like it in BindingDB:
Activity Spreadsheet -- Enzyme Inhibition Constant Data from BindingDB
Found 1 hit for monomerid = 50310184
TargetAmine oxidase [flavin-containing] B(Homo sapiens (Human))
Sapienza University Of Rome
Curated by ChEMBL
LigandPNGBDBM50310184(7,4'-dimethoxyflavone | 7-Methoxy-2-(4-methoxy-phe...)
Affinity DataIC50:  4.97E+4nM. Assay description: Inhibition of human recombinant MAOB expressed in BTI-TN-5B1-4 cells by para-tyramine oxidation assay
In DepthDetails ArticlePubMed