BDBM50310209 7-(3'-Cyclopentyloxy-4'-methoxyphenyl)-2-(4-methoxyphenyl)pyrazolo[1,5-a]pyrimidine::CHEMBL600989
SMILES COc1ccc(cc1)-c1cc2nccc(-c3ccc(OC)c(OC4CCCC4)c3)n2n1
InChI Key InChIKey=AKNFCRWBEBTKLD-UHFFFAOYSA-N
Data  1 IC50
  Tab Delimited (TSV)   2D SDfile   Computed 3D by Vconf -m prep SDfile
Find this compound or compounds like it in BindingDB:
Activity Spreadsheet -- Enzyme Inhibition Constant Data from BindingDB
Found 1 hit for monomerid = 50310209
TargetcAMP-specific 3',5'-cyclic phosphodiesterase 4D(Homo sapiens (Human))
Korea Research Institute Of Chemical Technology
Curated by ChEMBL
LigandPNGBDBM50310209(7-(3'-Cyclopentyloxy-4'-methoxyphenyl)-2-(4-methox...)
Affinity DataIC50:  60nM. Assay description: Inhibition of human PDE4D
In DepthDetails ArticlePubMed