BDBM50310264 CHEMBL598305::Dodecyl 2-(5-hydroxy-4-oxo-2-phenyl-4H-chromen-7-yloxy)acetate
SMILES CCCCCCCCCCCCOC(=O)COc1cc(O)c2c(c1)oc(cc2=O)-c1ccccc1
InChI Key InChIKey=BYKPOTXMKFGXPG-UHFFFAOYSA-N
Data  1 IC50
  Tab Delimited (TSV)   2D SDfile   Computed 3D by Vconf -m prep SDfile
Find this compound or compounds like it in BindingDB:
Activity Spreadsheet -- Enzyme Inhibition Constant Data from BindingDB
Found 1 hit for monomerid = 50310264
TargetEpidermal growth factor receptor(Homo sapiens (Human))
Nanjing University
Curated by ChEMBL
LigandPNGBDBM50310264(CHEMBL598305 | Dodecyl 2-(5-hydroxy-4-oxo-2-phenyl...)
Affinity DataIC50:  1.72E+3nM. Assay description: Inhibition of EGFR expressed in Sf9 cells assessed as inhibition of receptor autophosphorylation by DELFIA time resolved fluorometry
In DepthDetails ArticlePubMed