BDBM50310347 4-(3-amino-1-(4-methoxyphenyl)-1H-pyrazol-4-yl)benzamide::CHEMBL598237
SMILES COc1ccc(cc1)-n1cc(c(N)n1)-c1ccc(cc1)C(N)=O
InChI Key InChIKey=RASOBZOYDVIHOU-UHFFFAOYSA-N
Data  1 IC50
  Tab Delimited (TSV)   2D SDfile   Computed 3D by Vconf -m prep SDfile
Find this compound or compounds like it in BindingDB:
Activity Spreadsheet -- Enzyme Inhibition Constant Data from BindingDB
Found 1 hit for monomerid = 50310347
TargetMAP kinase-activated protein kinase 2(Homo sapiens (Human))
Novartis Institutes For Biomedical Research
Curated by ChEMBL
LigandPNGBDBM50310347(4-(3-amino-1-(4-methoxyphenyl)-1H-pyrazol-4-yl)ben...)
Affinity DataIC50:  2.00E+3nM. Assay description: Inhibition of human MK2 by FRET assay
In DepthDetails ArticlePubMed