BDBM50310379 (S)-5-[4-(2-Azepan-1-yl-ethoxy)-phenyl]-11,12-dihydro-5H-6,13-dioxa-benzo[3,4]cyclohepta[1,2-a]naphthalene-2,8-diol::CHEMBL1086774
SMILES Oc1ccc2C3=C([C@@H](Oc2c1)c1ccc(OCCN2CCCCCC2)cc1)c1ccc(O)cc1OCC3
InChI Key InChIKey=BPBTXNNZEZVAIO-HKBQPEDESA-N
Data  4 IC50
  Tab Delimited (TSV)   2D SDfile   Computed 3D by Vconf -m prep SDfile
Find this compound or compounds like it in BindingDB:
Activity Spreadsheet -- Enzyme Inhibition Constant Data from BindingDB
Found 4 hits for monomerid = 50310379
TargetEstrogen receptor beta(Homo sapiens (Human))
Johnson & Johnson Pharmaceutical Research & Development
Curated by ChEMBL
LigandPNGBDBM50310379((S)-5-[4-(2-Azepan-1-yl-ethoxy)-phenyl]-11,12-dihy...)
Affinity DataIC50:  13.4nM. Assay description: Inhibition of fluormone ES2 binding to estrogen receptor beta after 1 hr by fluorescence polarization assay
In DepthDetails ArticlePubMed
TargetEstrogen receptor(Homo sapiens (Human))
Johnson & Johnson Pharmaceutical Research & Development
Curated by ChEMBL
LigandPNGBDBM50310379((S)-5-[4-(2-Azepan-1-yl-ethoxy)-phenyl]-11,12-dihy...)
Affinity DataIC50:  401nM. Assay description: Antagonist activity at estrogen receptor in human MCF7 cells assessed as 17beta-estradiol-induced cell proliferation after 24 hrs by [14C]thymidine i...
In DepthDetails ArticlePubMed
TargetEstrogen receptor(Homo sapiens (Human))
Johnson & Johnson Pharmaceutical Research & Development
Curated by ChEMBL
LigandPNGBDBM50310379((S)-5-[4-(2-Azepan-1-yl-ethoxy)-phenyl]-11,12-dihy...)
Affinity DataIC50:  128nM. Assay description: Antagonist activity at estrogen receptor in human Ishikawa cells assessed as 17beta-estradiol-induced alkaline phosphatase activity after 3 days by c...
In DepthDetails ArticlePubMed
TargetEstrogen receptor(Homo sapiens (Human))
Johnson & Johnson Pharmaceutical Research & Development
Curated by ChEMBL
LigandPNGBDBM50310379((S)-5-[4-(2-Azepan-1-yl-ethoxy)-phenyl]-11,12-dihy...)
Affinity DataIC50:  2.40nM. Assay description: Displacement of radiolabeled estrogen from estrogen receptor alpha by scintillation counting
In DepthDetails ArticlePubMed