BDBM50310598 2-(3,4-dimethoxybenzoyl)-5,6-dimethoxy-2,3-dihydro-1H-inden-1-one::CHEMBL1078258
SMILES COc1ccc(cc1OC)C(=O)C1Cc2cc(OC)c(OC)cc2C1=O
InChI Key InChIKey=KRKPKRZYAMBZCV-UHFFFAOYSA-N
Data  1 IC50
  Tab Delimited (TSV)   2D SDfile   Computed 3D by Vconf -m prep SDfile
Find this compound or compounds like it in BindingDB:
Activity Spreadsheet -- Enzyme Inhibition Constant Data from BindingDB
Found 1 hit for monomerid = 50310598
TargetAcetylcholinesterase(Electrophorus electricus (Electric eel))
Alwar Pharmacy College
Curated by ChEMBL
LigandPNGBDBM50310598(2-(3,4-dimethoxybenzoyl)-5,6-dimethoxy-2,3-dihydro...)
Affinity DataIC50:  4.30E+3nM. Assay description: Inhibition of Electrophorus electricus AChE by Ellman's method
In DepthDetails ArticlePubMed