BDBM50310687 (2S)-2-amino-N-(1-cyano-2,2-dimethylcyclopropyl)-3-(thiophen-2-yl)propanamide::CHEMBL1078313
SMILES CC1(C)CC1(NC(=O)[C@@H](N)Cc1cccs1)C#N
InChI Key InChIKey=STGNLSGQGNWRDX-NKUHCKNESA-N
Data  1 IC50
  Tab Delimited (TSV)   2D SDfile   Computed 3D by Vconf -m prep SDfile
Find this compound or compounds like it in BindingDB:
Activity Spreadsheet -- Enzyme Inhibition Constant Data from BindingDB
Found 1 hit for monomerid = 50310687
TargetDipeptidyl peptidase 1(Homo sapiens (Human))
Merck Frosst Canada
Curated by ChEMBL
LigandPNGBDBM50310687((2S)-2-amino-N-(1-cyano-2,2-dimethylcyclopropyl)-3...)
Affinity DataIC50:  63nM. Assay description: Inhibition of human recombinant cathepsin C
In DepthDetails ArticlePubMed