BDBM50310804 CHEMBL1079245::N-(4-chlorophenyl)-3-(3-(2,3-dihydro-1H-tetrazol-5-ylamino)-3-oxopropyl)-3-phenylpiperidine-1-carboxamide
SMILES Clc1ccc(NC(=O)N2CCCC(CCC(=O)NC3=NNNN3)(C2)c2ccccc2)cc1
InChI Key InChIKey=PKPQLLBQJIRCMS-UHFFFAOYSA-N
Data  7 IC50
  Tab Delimited (TSV)   2D SDfile   Computed 3D by Vconf -m prep SDfile
Find this compound or compounds like it in BindingDB:
Activity Spreadsheet -- Enzyme Inhibition Constant Data from BindingDB
Found 7 hits for monomerid = 50310804
TargetBifunctional epoxide hydrolase 2(Homo sapiens (Human))
Merck Research Laboratories
Curated by ChEMBL
LigandPNGBDBM50310804(CHEMBL1079245 | N-(4-chlorophenyl)-3-(3-(2,3-dihyd...)
Affinity DataIC50:  1.40nM. Assay description: Inhibition of human soluble epoxide hydrolase
In DepthDetails ArticlePubMed
TargetBifunctional epoxide hydrolase 2(Rattus norvegicus)
Merck Research Laboratories
Curated by ChEMBL
LigandPNGBDBM50310804(CHEMBL1079245 | N-(4-chlorophenyl)-3-(3-(2,3-dihyd...)
Affinity DataIC50:  34nM. Assay description: Inhibition of rat soluble epoxide hydrolase
In DepthDetails ArticlePubMed
TargetBifunctional epoxide hydrolase 2(Homo sapiens (Human))
Merck Research Laboratories
Curated by ChEMBL
LigandPNGBDBM50310804(CHEMBL1079245 | N-(4-chlorophenyl)-3-(3-(2,3-dihyd...)
Affinity DataIC50:  1.40E+3nM. Assay description: Inhibition of human soluble epoxide hydrolase in HEK293 cells assessed as DHET production
In DepthDetails ArticlePubMed
TargetCytochrome P450 3A4(Homo sapiens (Human))
Merck Research Laboratories
Curated by ChEMBL
LigandPNGBDBM50310804(CHEMBL1079245 | N-(4-chlorophenyl)-3-(3-(2,3-dihyd...)
Affinity DataIC50: >1.00E+4nM. Assay description: Inhibition of CYP3A4
In DepthDetails ArticlePubMed
TargetCytochrome P450 2C9(Homo sapiens (Human))
Merck Research Laboratories
Curated by ChEMBL
LigandPNGBDBM50310804(CHEMBL1079245 | N-(4-chlorophenyl)-3-(3-(2,3-dihyd...)
Affinity DataIC50: >1.00E+4nM. Assay description: Inhibition of CYP2C9
In DepthDetails ArticlePubMed
TargetCytochrome P450 2D6(Homo sapiens (Human))
Merck Research Laboratories
Curated by ChEMBL
LigandPNGBDBM50310804(CHEMBL1079245 | N-(4-chlorophenyl)-3-(3-(2,3-dihyd...)
Affinity DataIC50: >1.00E+4nM. Assay description: Inhibition of CYP2D6
In DepthDetails ArticlePubMed
TargetEpoxide hydrolase 1(Homo sapiens (Human))
Merck Research Laboratories
Curated by ChEMBL
LigandPNGBDBM50310804(CHEMBL1079245 | N-(4-chlorophenyl)-3-(3-(2,3-dihyd...)
Affinity DataIC50: >1.00E+5nM. Assay description: Inhibition of human microsomal epoxide hydrolase
In DepthDetails ArticlePubMed